Target
Plasminogen
Ligand
BDBM50317098
Substrate
Meas. Tech.
ChEMBL_630641 (CHEMBL1111075)
IC50
>60000±n/a nM
Citation
 Fujimoto, TImaeda, YKonishi, NHiroe, KKawamura, MTextor, GPAertgeerts, KKubo, K Discovery of a tetrahydropyrimidin-2(1H)-one derivative (TAK-442) as a potent, selective, and orally active factor Xa inhibitor. J Med Chem 53:3517-31 (2010)  
Target
Name:
Plasminogen
Synonyms:
Activation peptide PLG Plasmin Plasmin heavy chain A, short form | Plasmin light chain B
Type:
Enzyme
Mol. Mass.:
90579.18
Organism:
Homo sapiens (Human)
Description:
Residue:
810
  
Inhibitor
Name:
BDBM50317098
Synonyms:
1-(1-{(2S)-3-[(6-chloronaphthalen-2-yl)sulfonyl]-2-hydroxypropanoyl}piperidin-4-yl)tetrahydropyrimidin-2(1H)-one TAK-442
Type:
Small organic molecule
Emp. Form.:
C22H26ClN3O5S
Mol. Mass.:
479.977
SMILES:
O[C@H](CS(=O)(=O)c1ccc2cc(Cl)ccc2c1)C(=O)N1CCC(CC1)N1CCCNC1=O
: