Target
M-phase inducer phosphatase 2
Ligand
BDBM50317380
Substrate
Meas. Tech.
ChEMBL_631608 (CHEMBL1106602)
IC50
340±n/a nM
Citation
 Chen, HJLiu, YWang, LNShen, QLi, JNan, FJ Discovery and structural optimization of pyrazole derivatives as novel inhibitors of Cdc25B. Bioorg Med Chem Lett 20:2876-9 (2010)  
Target
Name:
M-phase inducer phosphatase 2
Synonyms:
CDC25B Dual specificity phosphatase (CDC25B) M-phase inducer phosphatase 2 (CDC25B) | MPIP2_HUMAN
Type:
Protein
Mol. Mass.:
64985.27
Organism:
Homo sapiens (Human)
Description:
Residue:
580
  
Inhibitor
Name:
BDBM50317380
Synonyms:
CHEMBL1098821 | methyl 3-(4,6-dioxo-3-stearoylpyrrolo[3,4-c]pyrazol-5(1H,4H,6H)-yl)thiophene-2-carboxylate
Type:
Small organic molecule
Emp. Form.:
C29H41N3O5S
Mol. Mass.:
543.718
SMILES:
CCCCCCCCCCCCCCCCCC(=O)c1n[nH]c2C(=O)N(C(=O)c12)c1ccsc1C(=O)OC
: