Target
Sialidase
Ligand
BDBM50317428
Substrate
Meas. Tech.
ChEMBL_631810 (CHEMBL1109003)
IC50
46200±n/a nM
Citation
 Nguyen, PHNguyen, TNKang, KWNdinteh, DTMbafor, JTKim, YROh, WK Prenylated pterocarpans as bacterial neuraminidase inhibitors. Bioorg Med Chem 18:3335-44 (2010)  
Target
Name:
Sialidase
Synonyms:
NANH_VIBCH | nanH
Type:
PROTEIN
Mol. Mass.:
85590.05
Organism:
Vibrio cholerae
Description:
ChEMBL_631810
Residue:
781
  
Inhibitor
Name:
BDBM50317428
Synonyms:
CHEMBL1099089 | Erythribyssin D
Type:
Small organic molecule
Emp. Form.:
C20H20O5
Mol. Mass.:
340.3698
SMILES:
CC1(C)Oc2ccc3[C@@H]4COc5cc(O)ccc5[C@@H]4Oc3c2CC1O
: