Target
Sialidase
Ligand
BDBM50317430
Substrate
Meas. Tech.
ChEMBL_631810 (CHEMBL1109003)
IC50
22030±n/a nM
Citation
 Nguyen, PHNguyen, TNKang, KWNdinteh, DTMbafor, JTKim, YROh, WK Prenylated pterocarpans as bacterial neuraminidase inhibitors. Bioorg Med Chem 18:3335-44 (2010)  
Target
Name:
Sialidase
Synonyms:
NANH_VIBCH | nanH
Type:
PROTEIN
Mol. Mass.:
85590.05
Organism:
Vibrio cholerae
Description:
ChEMBL_631810
Residue:
781
  
Inhibitor
Name:
BDBM50317430
Synonyms:
CHEMBL454849 cristacarpin | crystacarpin
Type:
Small organic molecule
Emp. Form.:
C21H22O5
Mol. Mass.:
354.3964
SMILES:
[#6]-[#8]-c1ccc2c(-[#8]-[#6@H]3-c4ccc(-[#8])cc4-[#8]-[#6][C@@]23[#8])c1-[#6]\[#6]=[#6](\[#6])-[#6]
: