Target
Sialidase
Ligand
BDBM50317434
Substrate
Meas. Tech.
ChEMBL_631812 (CHEMBL1111005)
Ki
2550±n/a nM
Citation
 Nguyen, PHNguyen, TNKang, KWNdinteh, DTMbafor, JTKim, YROh, WK Prenylated pterocarpans as bacterial neuraminidase inhibitors. Bioorg Med Chem 18:3335-44 (2010)  
Target
Name:
Sialidase
Synonyms:
NANH_CLOPF | nanH
Type:
PROTEIN
Mol. Mass.:
42808.79
Organism:
Clostridium perfringens
Description:
ChEMBL_991336
Residue:
382
  
Inhibitor
Name:
BDBM50317434
Synonyms:
CHEMBL1097045 | eryvarin D
Type:
Small organic molecule
Emp. Form.:
C21H20O4
Mol. Mass.:
336.3811
SMILES:
[#6]-[#8]-c1ccc2c3-[#6]-[#8]-c4cc(-[#8])ccc4-c3oc2c1-[#6]\[#6]=[#6](\[#6])-[#6]
: