Target
Sialidase
Ligand
BDBM50317437
Substrate
Meas. Tech.
ChEMBL_631812 (CHEMBL1111005)
Ki
4130±n/a nM
Citation
 Nguyen, PHNguyen, TNKang, KWNdinteh, DTMbafor, JTKim, YROh, WK Prenylated pterocarpans as bacterial neuraminidase inhibitors. Bioorg Med Chem 18:3335-44 (2010)  
Target
Name:
Sialidase
Synonyms:
NANH_CLOPF | nanH
Type:
PROTEIN
Mol. Mass.:
42808.79
Organism:
Clostridium perfringens
Description:
ChEMBL_991336
Residue:
382
  
Inhibitor
Name:
BDBM50317437
Synonyms:
CHEMBL1096408 | Erythribyssin L
Type:
Small organic molecule
Emp. Form.:
C25H28O5
Mol. Mass.:
408.4868
SMILES:
[#6]\[#6](-[#6])=[#6]\[#6]-c1c2-[#8]-[#6@@H]-3-[#6@@H](-[#6]-[#8]-c4cc5-[#8]C([#6])([#6])[#6](-[#8])-[#6]-c5cc-34)-c2ccc1-[#8]
: