Target
Sialidase
Ligand
BDBM50317438
Substrate
Meas. Tech.
ChEMBL_631813 (CHEMBL1111006)
Ki
4840±n/a nM
Citation
 Nguyen, PHNguyen, TNKang, KWNdinteh, DTMbafor, JTKim, YROh, WK Prenylated pterocarpans as bacterial neuraminidase inhibitors. Bioorg Med Chem 18:3335-44 (2010)  
Target
Name:
Sialidase
Synonyms:
NANH_CLOPF | nanH
Type:
PROTEIN
Mol. Mass.:
42808.79
Organism:
Clostridium perfringens
Description:
ChEMBL_991336
Residue:
382
  
Inhibitor
Name:
BDBM50317438
Synonyms:
Abyssinone I phaseollin
Type:
Small organic molecule
Emp. Form.:
C20H18O4
Mol. Mass.:
322.3545
SMILES:
CC1(C)Oc2ccc3[C@@H]4COc5cc(O)ccc5[C@@H]4Oc3c2C=C1
: