Target
Sialidase
Ligand
BDBM50317439
Substrate
Meas. Tech.
ChEMBL_631813 (CHEMBL1111006)
Ki
15200±n/a nM
Citation
 Nguyen, PHNguyen, TNKang, KWNdinteh, DTMbafor, JTKim, YROh, WK Prenylated pterocarpans as bacterial neuraminidase inhibitors. Bioorg Med Chem 18:3335-44 (2010)  
Target
Name:
Sialidase
Synonyms:
NANH_CLOPF | nanH
Type:
PROTEIN
Mol. Mass.:
42808.79
Organism:
Clostridium perfringens
Description:
ChEMBL_991336
Residue:
382
  
Inhibitor
Name:
BDBM50317439
Synonyms:
CHEMBL1095422 | erysubin D
Type:
Small organic molecule
Emp. Form.:
C25H28O5
Mol. Mass.:
408.4868
SMILES:
[#6]\[#6](-[#6])=[#6]\[#6]-c1cc2-[#6@@H]-3-[#8]-c4c(ccc5-[#8]C([#6])([#6])[#6](-[#8])-[#6]-c45)-[#6@@H]-3-[#6]-[#8]-c2cc1-[#8]
: