Target
Sialidase
Ligand
BDBM50317432
Substrate
Meas. Tech.
ChEMBL_631808 (CHEMBL1108201)
IC50
19820±n/a nM
Citation
 Nguyen, PHNguyen, TNKang, KWNdinteh, DTMbafor, JTKim, YROh, WK Prenylated pterocarpans as bacterial neuraminidase inhibitors. Bioorg Med Chem 18:3335-44 (2010)  
Target
Name:
Sialidase
Synonyms:
NANH_CLOPF | nanH
Type:
PROTEIN
Mol. Mass.:
42808.79
Organism:
Clostridium perfringens
Description:
ChEMBL_991336
Residue:
382
  
Inhibitor
Name:
BDBM50317432
Synonyms:
CHEMBL1098728 | NEORAUTENOL
Type:
Small organic molecule
Emp. Form.:
C20H18O4
Mol. Mass.:
322.3545
SMILES:
CC1(C)Oc2cc3OC[C@@H]4[C@@H](Oc5cc(O)ccc45)c3cc2C=C1
: