Target
Sialidase
Ligand
BDBM50317430
Substrate
Meas. Tech.
ChEMBL_631808 (CHEMBL1108201)
IC50
2280±n/a nM
Citation
 Nguyen, PHNguyen, TNKang, KWNdinteh, DTMbafor, JTKim, YROh, WK Prenylated pterocarpans as bacterial neuraminidase inhibitors. Bioorg Med Chem 18:3335-44 (2010)  
Target
Name:
Sialidase
Synonyms:
NANH_CLOPF | nanH
Type:
PROTEIN
Mol. Mass.:
42808.79
Organism:
Clostridium perfringens
Description:
ChEMBL_991336
Residue:
382
  
Inhibitor
Name:
BDBM50317430
Synonyms:
CHEMBL454849 cristacarpin | crystacarpin
Type:
Small organic molecule
Emp. Form.:
C21H22O5
Mol. Mass.:
354.3964
SMILES:
[#6]-[#8]-c1ccc2c(-[#8]-[#6@H]3-c4ccc(-[#8])cc4-[#8]-[#6][C@@]23[#8])c1-[#6]\[#6]=[#6](\[#6])-[#6]
: