Target
Sialidase
Ligand
BDBM7460
Substrate
Meas. Tech.
ChEMBL_631808 (CHEMBL1108201)
IC50
25340±n/a nM
Citation
 Nguyen, PHNguyen, TNKang, KWNdinteh, DTMbafor, JTKim, YROh, WK Prenylated pterocarpans as bacterial neuraminidase inhibitors. Bioorg Med Chem 18:3335-44 (2010)  
Target
Name:
Sialidase
Synonyms:
NANH_CLOPF | nanH
Type:
PROTEIN
Mol. Mass.:
42808.79
Organism:
Clostridium perfringens
Description:
ChEMBL_991336
Residue:
382
  
Inhibitor
Name:
BDBM7460
Synonyms:
2-(3,4-dihydroxyphenyl)-3,5,7-trihydroxy-4H-chromen-4-one 2-(3,4-dihydroxyphenyl)-3,5,7-trihydroxy-chromone;hydrate Quercetin Quercetin (21) US11021454, Compound Quercetin med.21724, Compound 4
Type:
Small organic molecule
Emp. Form.:
C15H10O7
Mol. Mass.:
302.2357
SMILES:
Oc1cc(O)c2c(c1)oc(-c1ccc(O)c(O)c1)c(O)c2=O
: