Target
Sialidase
Ligand
BDBM50311581
Substrate
Meas. Tech.
ChEMBL_631810 (CHEMBL1109003)
IC50
19480±n/a nM
Citation
 Nguyen, PHNguyen, TNKang, KWNdinteh, DTMbafor, JTKim, YROh, WK Prenylated pterocarpans as bacterial neuraminidase inhibitors. Bioorg Med Chem 18:3335-44 (2010)  
Target
Name:
Sialidase
Synonyms:
NANH_VIBCH | nanH
Type:
PROTEIN
Mol. Mass.:
85590.05
Organism:
Vibrio cholerae
Description:
ChEMBL_631810
Residue:
781
  
Inhibitor
Name:
BDBM50311581
Synonyms:
CHEMBL1086764 | erysubin E
Type:
Small organic molecule
Emp. Form.:
C25H26O5
Mol. Mass.:
406.4709
SMILES:
[#6]\[#6](-[#6])=[#6]/[#6]-c1cc2-[#6@@H]3-[#8]-c4c(ccc5-[#8]C([#6])([#6])[#6]=[#6]-c45)[C@]3([#8])[#6]-[#8]-c2cc1-[#8]
: