Target
Sodium-dependent dopamine transporter
Ligand
BDBM50243500
Substrate
Meas. Tech.
ChEMBL_632362 (CHEMBL1115567)
IC50
175±n/a nM
Citation
 Sabatucci, JPMahaney, PELeiter, JJohnston, GBurroughs, KCosmi, SZhang, YHo, DDeecher, DCTrybulski, E Heterocyclic cycloalkanol ethylamines as norepinephrine reuptake inhibitors. Bioorg Med Chem Lett 20:2809-12 (2010)  
Target
Name:
Sodium-dependent dopamine transporter
Synonyms:
DA transporter DAT1 Dopamine transporter protein (DAT) SC6A3_HUMAN Sodium-dependent dopamine transporter Solute carrier family 6 member 3
Type:
Multi-pass membrane protein
Mol. Mass.:
68497.11
Organism:
Homo sapiens (Human)
Description:
Q01959
Residue:
620
  
Inhibitor
Name:
BDBM50243500
Synonyms:
(-)-1-[(1S)-1-(3-Chlorophenyl)-2-(4-methylpiperazin-1-yl)ethyl]cyclohexanol Dihydrocholoride CHEMBL511525
Type:
Small organic molecule
Emp. Form.:
C19H29ClN2O
Mol. Mass.:
336.899
SMILES:
CN1CCN(C[C@H](c2cccc(Cl)c2)C2(O)CCCCC2)CC1
: