Target
Sodium-dependent serotonin transporter
Ligand
BDBM84745
Substrate
Meas. Tech.
ChEMBL_632361 (CHEMBL1115566)
IC50
3±n/a nM
Citation
 Sabatucci, JPMahaney, PELeiter, JJohnston, GBurroughs, KCosmi, SZhang, YHo, DDeecher, DCTrybulski, E Heterocyclic cycloalkanol ethylamines as norepinephrine reuptake inhibitors. Bioorg Med Chem Lett 20:2809-12 (2010)  
Target
Name:
Sodium-dependent serotonin transporter
Synonyms:
5-HT Transporter 5HTT SC6A4_HUMAN SLC6A4 Serotonin transporter (5HTT) Sodium-dependent serotonin transporter (SERT) | Solute carrier family 6 member 4
Type:
Multi-pass membrane protein
Mol. Mass.:
70322.51
Organism:
Homo sapiens (Human)
Description:
P31645
Residue:
630
  
Inhibitor
Name:
BDBM84745
Synonyms:
CAS_136434-34-9 LY-248686 USRE49340, Rank 5
Type:
Small organic molecule
Emp. Form.:
C18H19NOS
Mol. Mass.:
297.415
SMILES:
CNCC[C@H](Oc1cccc2ccccc12)c1cccs1
: