Target
Sodium-dependent noradrenaline transporter
Ligand
BDBM50317596
Substrate
Meas. Tech.
ChEMBL_632360 (CHEMBL1115565)
IC50
255±n/a nM
Citation
 Sabatucci, JPMahaney, PELeiter, JJohnston, GBurroughs, KCosmi, SZhang, YHo, DDeecher, DCTrybulski, E Heterocyclic cycloalkanol ethylamines as norepinephrine reuptake inhibitors. Bioorg Med Chem Lett 20:2809-12 (2010)  
Target
Name:
Sodium-dependent noradrenaline transporter
Synonyms:
Monoamine transporter NET Noradrenaline Transporter (NET) Norepinephrine transporter protein (NET) SLC6A2 Sodium-dependent noradrenaline transporter (NET) | Solute carrier family 6 member 2
Type:
Multi-pass membrane protein
Mol. Mass.:
69337.72
Organism:
Homo sapiens (Human)
Description:
P23975
Residue:
617
  
Inhibitor
Name:
BDBM50317596
Synonyms:
1-(1-(benzo[b]thiophen-3-yl)-2-(piperazin-1-yl)ethyl)cyclohexanol | CHEMBL1097469
Type:
Small organic molecule
Emp. Form.:
C20H28N2OS
Mol. Mass.:
344.514
SMILES:
OC1(CCCCC1)C(CN1CCNCC1)c1csc2ccccc12
: