Target
Sodium-dependent noradrenaline transporter
Ligand
BDBM50243500
Substrate
Meas. Tech.
ChEMBL_632360 (CHEMBL1115565)
IC50
30±n/a nM
Citation
 Sabatucci, JPMahaney, PELeiter, JJohnston, GBurroughs, KCosmi, SZhang, YHo, DDeecher, DCTrybulski, E Heterocyclic cycloalkanol ethylamines as norepinephrine reuptake inhibitors. Bioorg Med Chem Lett 20:2809-12 (2010)  
Target
Name:
Sodium-dependent noradrenaline transporter
Synonyms:
Monoamine transporter NET Noradrenaline Transporter (NET) Norepinephrine transporter protein (NET) SLC6A2 Sodium-dependent noradrenaline transporter (NET) | Solute carrier family 6 member 2
Type:
Multi-pass membrane protein
Mol. Mass.:
69337.72
Organism:
Homo sapiens (Human)
Description:
P23975
Residue:
617
  
Inhibitor
Name:
BDBM50243500
Synonyms:
(-)-1-[(1S)-1-(3-Chlorophenyl)-2-(4-methylpiperazin-1-yl)ethyl]cyclohexanol Dihydrocholoride CHEMBL511525
Type:
Small organic molecule
Emp. Form.:
C19H29ClN2O
Mol. Mass.:
336.899
SMILES:
CN1CCN(C[C@H](c2cccc(Cl)c2)C2(O)CCCCC2)CC1
: