Target
Histamine H3 receptor
Ligand
BDBM50317711
Substrate
Meas. Tech.
ChEMBL_629414 (CHEMBL1105767)
Ki
1.3±n/a nM
Citation
 Stocking, EMAluisio, LAtack, JRBonaventure, PCarruthers, NIDugovic, CEverson, AFraser, IJiang, XLeung, PLord, BLy, KSMorton, KLNepomuceno, DShah, CRShelton, JSoyode-Johnson, ALetavic, MA Novel substituted pyrrolidines are high affinity histamine H3 receptor antagonists. Bioorg Med Chem Lett 20:2755-60 (2010)  
Target
Name:
Histamine H3 receptor
Synonyms:
G-protein coupled receptor 97 HH3R HRH3 Histamine H3 receptor (H3) Histamine receptor (H3 and H4)
Type:
G Protein-Coupled Receptor (GPCR)
Mol. Mass.:
48691.47
Organism:
Homo sapiens (Human)
Description:
Binding assays were using CHO cells stably expressing hH3R receptors.
Residue:
445
  
Inhibitor
Name:
BDBM50317711
Synonyms:
((2R,4S)-4-(4-chloro-3-methylphenoxy)pyrrolidin-2-yl)(4-cyclobutyl-1,4-diazepan-1-yl)methanone | CHEMBL1099147
Type:
Small organic molecule
Emp. Form.:
C21H30ClN3O2
Mol. Mass.:
391.935
SMILES:
Cc1cc(O[C@@H]2CN[C@H](C2)C(=O)N2CCCN(CC2)C2CCC2)ccc1Cl
: