Target
Histamine H3 receptor
Ligand
BDBM50317706
Substrate
Meas. Tech.
ChEMBL_629414 (CHEMBL1105767)
Ki
1.5±n/a nM
Citation
 Stocking, EMAluisio, LAtack, JRBonaventure, PCarruthers, NIDugovic, CEverson, AFraser, IJiang, XLeung, PLord, BLy, KSMorton, KLNepomuceno, DShah, CRShelton, JSoyode-Johnson, ALetavic, MA Novel substituted pyrrolidines are high affinity histamine H3 receptor antagonists. Bioorg Med Chem Lett 20:2755-60 (2010)  
Target
Name:
Histamine H3 receptor
Synonyms:
G-protein coupled receptor 97 HH3R HRH3 Histamine H3 receptor (H3) Histamine receptor (H3 and H4)
Type:
G Protein-Coupled Receptor (GPCR)
Mol. Mass.:
48691.47
Organism:
Homo sapiens (Human)
Description:
Binding assays were using CHO cells stably expressing hH3R receptors.
Residue:
445
  
Inhibitor
Name:
BDBM50317706
Synonyms:
1-((2R,4S)-2-(4-cyclobutyl-1,4-diazepane-1-carbonyl)-4-(4-fluorophenoxy)pyrrolidin-1-yl)ethanone | CHEMBL1094562
Type:
Small organic molecule
Emp. Form.:
C22H30FN3O3
Mol. Mass.:
403.4903
SMILES:
CC(=O)N1C[C@H](C[C@@H]1C(=O)N1CCCN(CC1)C1CCC1)Oc1ccc(F)cc1
: