Target
Histamine H3 receptor
Ligand
BDBM50317720
Substrate
Meas. Tech.
ChEMBL_629414 (CHEMBL1105767)
Ki
1.2±n/a nM
Citation
 Stocking, EMAluisio, LAtack, JRBonaventure, PCarruthers, NIDugovic, CEverson, AFraser, IJiang, XLeung, PLord, BLy, KSMorton, KLNepomuceno, DShah, CRShelton, JSoyode-Johnson, ALetavic, MA Novel substituted pyrrolidines are high affinity histamine H3 receptor antagonists. Bioorg Med Chem Lett 20:2755-60 (2010)  
Target
Name:
Histamine H3 receptor
Synonyms:
G-protein coupled receptor 97 HH3R HRH3 Histamine H3 receptor (H3) Histamine receptor (H3 and H4)
Type:
G Protein-Coupled Receptor (GPCR)
Mol. Mass.:
48691.47
Organism:
Homo sapiens (Human)
Description:
Binding assays were using CHO cells stably expressing hH3R receptors.
Residue:
445
  
Inhibitor
Name:
BDBM50317720
Synonyms:
(4-cyclobutyl-1,4-diazepan-1-yl)((2R,4S)-4-(4-fluorophenoxy)-1-(methylsulfonyl)pyrrolidin-2-yl)methanone | CHEMBL1096522
Type:
Small organic molecule
Emp. Form.:
C21H30FN3O4S
Mol. Mass.:
439.544
SMILES:
CS(=O)(=O)N1C[C@H](C[C@@H]1C(=O)N1CCCN(CC1)C1CCC1)Oc1ccc(F)cc1
: