Target
Metabotropic glutamate receptor 5
Ligand
BDBM50317843
Substrate
Meas. Tech.
ChEMBL_629919 (CHEMBL1108383)
Ki
862±n/a nM
Citation
 Zhang, PZou, MFRodriguez, ALConn, PJNewman, AH Structure-activity relationships in a novel series of 7-substituted-aryl quinolines and 5-substituted-aryl benzothiazoles at the metabotropic glutamate receptor subtype 5. Bioorg Med Chem 18:3026-35 (2010)  
Target
Name:
Metabotropic glutamate receptor 5
Synonyms:
GRM5_RAT Grm5 Mglur5 metabotropic glutamate 5/1-C metabotropic glutamate 5a
Type:
Enzyme
Mol. Mass.:
131900.14
Organism:
Rattus norvegicus (Rat)
Description:
P31424
Residue:
1203
  
Inhibitor
Name:
BDBM50317843
Synonyms:
2-Cyano-4-(2-methylbenzo[d]thiazol-5-yl)phenyl trifluoromethanesulfonate | CHEMBL1098212
Type:
Small organic molecule
Emp. Form.:
C16H9F3N2O3S2
Mol. Mass.:
398.379
SMILES:
Cc1nc2cc(ccc2s1)-c1ccc(OS(=O)(=O)C(F)(F)F)c(c1)C#N
: