Target
Metabotropic glutamate receptor 5
Ligand
BDBM50317846
Substrate
Meas. Tech.
ChEMBL_629919 (CHEMBL1108383)
Ki
1040±n/a nM
Citation
 Zhang, PZou, MFRodriguez, ALConn, PJNewman, AH Structure-activity relationships in a novel series of 7-substituted-aryl quinolines and 5-substituted-aryl benzothiazoles at the metabotropic glutamate receptor subtype 5. Bioorg Med Chem 18:3026-35 (2010)  
Target
Name:
Metabotropic glutamate receptor 5
Synonyms:
GRM5_RAT Grm5 Mglur5 metabotropic glutamate 5/1-C metabotropic glutamate 5a
Type:
Enzyme
Mol. Mass.:
131900.14
Organism:
Rattus norvegicus (Rat)
Description:
P31424
Residue:
1203
  
Inhibitor
Name:
BDBM50317846
Synonyms:
2-Benzoxy-5-(2-methylquinolin-7-yl)benzonitrile | CHEMBL1098228
Type:
Small organic molecule
Emp. Form.:
C24H18N2O
Mol. Mass.:
350.4125
SMILES:
Cc1ccc2ccc(cc2n1)-c1ccc(OCc2ccccc2)c(c1)C#N
: