Target
Metabotropic glutamate receptor 5
Ligand
BDBM50317842
Substrate
Meas. Tech.
ChEMBL_629920 (CHEMBL1108384)
IC50
>10000±n/a nM
Citation
 Zhang, PZou, MFRodriguez, ALConn, PJNewman, AH Structure-activity relationships in a novel series of 7-substituted-aryl quinolines and 5-substituted-aryl benzothiazoles at the metabotropic glutamate receptor subtype 5. Bioorg Med Chem 18:3026-35 (2010)  
Target
Name:
Metabotropic glutamate receptor 5
Synonyms:
GRM5_RAT Grm5 Mglur5 metabotropic glutamate 5/1-C metabotropic glutamate 5a
Type:
Enzyme
Mol. Mass.:
131900.14
Organism:
Rattus norvegicus (Rat)
Description:
P31424
Residue:
1203
  
Inhibitor
Name:
BDBM50317842
Synonyms:
2-Hydroxy-5-(2-methylquinolin-7-yl)benzonitrile | CHEMBL1098211
Type:
Small organic molecule
Emp. Form.:
C17H12N2O
Mol. Mass.:
260.29
SMILES:
Cc1ccc2ccc(cc2n1)-c1ccc(O)c(c1)C#N
: