Target
Metabotropic glutamate receptor 5
Ligand
BDBM50317847
Substrate
Meas. Tech.
ChEMBL_629920 (CHEMBL1108384)
IC50
>10000±n/a nM
Citation
 Zhang, PZou, MFRodriguez, ALConn, PJNewman, AH Structure-activity relationships in a novel series of 7-substituted-aryl quinolines and 5-substituted-aryl benzothiazoles at the metabotropic glutamate receptor subtype 5. Bioorg Med Chem 18:3026-35 (2010)  
Target
Name:
Metabotropic glutamate receptor 5
Synonyms:
GRM5_RAT Grm5 Mglur5 metabotropic glutamate 5/1-C metabotropic glutamate 5a
Type:
Enzyme
Mol. Mass.:
131900.14
Organism:
Rattus norvegicus (Rat)
Description:
P31424
Residue:
1203
  
Inhibitor
Name:
BDBM50317847
Synonyms:
2-Benzoxy-5-(2-methylbenzo[d]thiazol-5-yl)benzonitrile | CHEMBL1098805
Type:
Small organic molecule
Emp. Form.:
C22H16N2OS
Mol. Mass.:
356.44
SMILES:
Cc1nc2cc(ccc2s1)-c1ccc(OCc2ccccc2)c(c1)C#N
: