Target
Metabotropic glutamate receptor 5
Ligand
BDBM50317852
Substrate
Meas. Tech.
ChEMBL_629920 (CHEMBL1108384)
IC50
6890±n/a nM
Citation
 Zhang, PZou, MFRodriguez, ALConn, PJNewman, AH Structure-activity relationships in a novel series of 7-substituted-aryl quinolines and 5-substituted-aryl benzothiazoles at the metabotropic glutamate receptor subtype 5. Bioorg Med Chem 18:3026-35 (2010)  
Target
Name:
Metabotropic glutamate receptor 5
Synonyms:
GRM5_RAT Grm5 Mglur5 metabotropic glutamate 5/1-C metabotropic glutamate 5a
Type:
Enzyme
Mol. Mass.:
131900.14
Organism:
Rattus norvegicus (Rat)
Description:
P31424
Residue:
1203
  
Inhibitor
Name:
BDBM50317852
Synonyms:
2-Phenyl-4-(2-methylbenzo[d]thiazol-5-yl)benzonitrile | CHEMBL1096844
Type:
Small organic molecule
Emp. Form.:
C20H12N2S
Mol. Mass.:
312.388
SMILES:
N#Cc1cc(ccc1-c1ccccc1)-c1ccc2scnc2c1
: