Target
Metabotropic glutamate receptor 5
Ligand
BDBM50317854
Substrate
Meas. Tech.
ChEMBL_629920 (CHEMBL1108384)
IC50
13±n/a nM
Citation
 Zhang, PZou, MFRodriguez, ALConn, PJNewman, AH Structure-activity relationships in a novel series of 7-substituted-aryl quinolines and 5-substituted-aryl benzothiazoles at the metabotropic glutamate receptor subtype 5. Bioorg Med Chem 18:3026-35 (2010)  
Target
Name:
Metabotropic glutamate receptor 5
Synonyms:
GRM5_RAT Grm5 Mglur5 metabotropic glutamate 5/1-C metabotropic glutamate 5a
Type:
Enzyme
Mol. Mass.:
131900.14
Organism:
Rattus norvegicus (Rat)
Description:
P31424
Residue:
1203
  
Inhibitor
Name:
BDBM50317854
Synonyms:
5-((6-Methylpyridin-2-yl)ethynyl)nicotinonitrile | CHEMBL1098656
Type:
Small organic molecule
Emp. Form.:
C14H9N3
Mol. Mass.:
219.2414
SMILES:
Cc1cccc(n1)C#Cc1cncc(c1)C#N
: