Target
Prostaglandin G/H synthase 1
Ligand
BDBM50317917
Substrate
Meas. Tech.
ChEMBL_630412 (CHEMBL1113783)
IC50
347±n/a nM
Citation
 Singh, PBhardwaj, A Mono-, di-, and triaryl substituted tetrahydropyrans as cyclooxygenase-2 and tumor growth inhibitors. Synthesis and biological evaluation. J Med Chem 53:3707-17 (2010)  
Target
Name:
Prostaglandin G/H synthase 1
Synonyms:
COX1 Cyclooxygenase-1 (COX-1) PTGS1 | Prostaglandin G/H synthase (cyclooxygenase)
Type:
Protein
Mol. Mass.:
68868.60
Organism:
Ovis aries (Sheep)
Description:
Residue:
600
  
Inhibitor
Name:
BDBM50317917
Synonyms:
(2S*,4R*,6S*)-2-((Ethylthio)methyl)tetrahydro-6-methyl-4-phenyl-2H-pyran-4-ol | CHEMBL1096320
Type:
Small organic molecule
Emp. Form.:
C15H22O2S
Mol. Mass.:
266.399
SMILES:
CCSC[C@@H]1C[C@](O)(C[C@H](C)O1)c1ccccc1
: