Target
Prostaglandin G/H synthase 1
Ligand
BDBM50317920
Substrate
Meas. Tech.
ChEMBL_630412 (CHEMBL1113783)
IC50
2788±n/a nM
Citation
 Singh, PBhardwaj, A Mono-, di-, and triaryl substituted tetrahydropyrans as cyclooxygenase-2 and tumor growth inhibitors. Synthesis and biological evaluation. J Med Chem 53:3707-17 (2010)  
Target
Name:
Prostaglandin G/H synthase 1
Synonyms:
COX1 Cyclooxygenase-1 (COX-1) PTGS1 | Prostaglandin G/H synthase (cyclooxygenase)
Type:
Protein
Mol. Mass.:
68868.60
Organism:
Ovis aries (Sheep)
Description:
Residue:
600
  
Inhibitor
Name:
BDBM50317920
Synonyms:
(2R*,4R*,6S*)-Tetrahydro-2,4-diphenyl-6-(thiocyanatomethyl)-2H-pyran-4-ol | CHEMBL1096036
Type:
Small organic molecule
Emp. Form.:
C19H19NO2S
Mol. Mass.:
325.425
SMILES:
O[C@]1(C[C@@H](CSC#N)O[C@H](C1)c1ccccc1)c1ccccc1
: