Target
Prostaglandin G/H synthase 2
Ligand
BDBM50317923
Substrate
Meas. Tech.
ChEMBL_630411 (CHEMBL1113782)
IC50
1.82±n/a nM
Citation
 Singh, PBhardwaj, A Mono-, di-, and triaryl substituted tetrahydropyrans as cyclooxygenase-2 and tumor growth inhibitors. Synthesis and biological evaluation. J Med Chem 53:3707-17 (2010)  
Target
Name:
Prostaglandin G/H synthase 2
Synonyms:
COX2 Cyclooxygenase-2 (COX-2) PTGS2 Prostaglandin G/H synthase (cyclooxygenase)
Type:
Protein
Mol. Mass.:
68976.98
Organism:
Ovis aries (Sheep)
Description:
Residue:
603
  
Inhibitor
Name:
BDBM50317923
Synonyms:
(2R*,4R*,6S*)-2-(4-Chlorophenyl)-6-((ethylthio)methyl)tetrahydro-4-phenyl-2H-pyran-4-ol | CHEMBL1095082
Type:
Small organic molecule
Emp. Form.:
C20H23ClO2S
Mol. Mass.:
362.913
SMILES:
CCSC[C@@H]1C[C@](O)(C[C@@H](O1)c1ccc(Cl)cc1)c1ccccc1
: