Target
Prostaglandin G/H synthase 1
Ligand
BDBM50317929
Substrate
Meas. Tech.
ChEMBL_630412 (CHEMBL1113783)
IC50
46990±n/a nM
Citation
 Singh, PBhardwaj, A Mono-, di-, and triaryl substituted tetrahydropyrans as cyclooxygenase-2 and tumor growth inhibitors. Synthesis and biological evaluation. J Med Chem 53:3707-17 (2010)  
Target
Name:
Prostaglandin G/H synthase 1
Synonyms:
COX1 Cyclooxygenase-1 (COX-1) PTGS1 | Prostaglandin G/H synthase (cyclooxygenase)
Type:
Protein
Mol. Mass.:
68868.60
Organism:
Ovis aries (Sheep)
Description:
Residue:
600
  
Inhibitor
Name:
BDBM50317929
Synonyms:
(2R*,3S*,4R*,6S*)-6-((Ethylthio)methyl)-2-(4-fluorophenyl)-tetrahydro-3,4-diphenyl-2H-pyran-4-ol | CHEMBL1094413
Type:
Small organic molecule
Emp. Form.:
C26H27FO2S
Mol. Mass.:
422.555
SMILES:
CCSC[C@@H]1C[C@@](O)([C@H]([C@@H](O1)c1ccc(F)cc1)c1ccccc1)c1ccccc1
: