Target
Prostaglandin G/H synthase 2
Ligand
BDBM50317932
Substrate
Meas. Tech.
ChEMBL_630411 (CHEMBL1113782)
IC50
0.65±n/a nM
Citation
 Singh, PBhardwaj, A Mono-, di-, and triaryl substituted tetrahydropyrans as cyclooxygenase-2 and tumor growth inhibitors. Synthesis and biological evaluation. J Med Chem 53:3707-17 (2010)  
Target
Name:
Prostaglandin G/H synthase 2
Synonyms:
COX2 Cyclooxygenase-2 (COX-2) PTGS2 Prostaglandin G/H synthase (cyclooxygenase)
Type:
Protein
Mol. Mass.:
68976.98
Organism:
Ovis aries (Sheep)
Description:
Residue:
603
  
Inhibitor
Name:
BDBM50317932
Synonyms:
(2R*,3S*,4R*,6S*)-2-(4-Chlorophenyl)tetrahydro-3,4-diphenyl-6-(thiocyanatomethyl)-2H-pyran-4-ol | CHEMBL1096724
Type:
Small organic molecule
Emp. Form.:
C25H22ClNO2S
Mol. Mass.:
435.966
SMILES:
O[C@@]1(C[C@@H](CSC#N)O[C@H]([C@@H]1c1ccccc1)c1ccc(Cl)cc1)c1ccccc1
: