Target
Histone deacetylase 2
Ligand
BDBM50317999
Substrate
Meas. Tech.
ChEMBL_630931 (CHEMBL1116530)
IC50
270±n/a nM
Citation
 Bressi, JCJennings, AJSkene, RWu, YMelkus, RDe Jong, RO'Connell, SGrimshaw, CENavre, MGangloff, AR Exploration of the HDAC2 foot pocket: Synthesis and SAR of substituted N-(2-aminophenyl)benzamides. Bioorg Med Chem Lett 20:3142-5 (2010)  
Target
Name:
Histone deacetylase 2
Synonyms:
Cereblon/Histone deacetylase 2 HDAC2 Histone deacetylase 2 (HDAC2) | Human HDAC2
Type:
Chromatin regulator; hydrolase; repressor
Mol. Mass.:
55356.54
Organism:
Homo sapiens (Human)
Description:
Q92769
Residue:
488
  
Inhibitor
Name:
BDBM50317999
Synonyms:
CHEMBL1095096 | N-(2-amino-5-(pyridin-4-yl)phenyl)benzamide
Type:
Small organic molecule
Emp. Form.:
C18H15N3O
Mol. Mass.:
289.3312
SMILES:
Nc1ccc(cc1NC(=O)c1ccccc1)-c1ccncc1
: