Target
Histone deacetylase 2
Ligand
BDBM50317991
Substrate
Meas. Tech.
ChEMBL_630930 (CHEMBL1116529)
IC50
3400±n/a nM
Citation
 Bressi, JCJennings, AJSkene, RWu, YMelkus, RDe Jong, RO'Connell, SGrimshaw, CENavre, MGangloff, AR Exploration of the HDAC2 foot pocket: Synthesis and SAR of substituted N-(2-aminophenyl)benzamides. Bioorg Med Chem Lett 20:3142-5 (2010)  
Target
Name:
Histone deacetylase 2
Synonyms:
Cereblon/Histone deacetylase 2 HDAC2 Histone deacetylase 2 (HDAC2) | Human HDAC2
Type:
Chromatin regulator; hydrolase; repressor
Mol. Mass.:
55356.54
Organism:
Homo sapiens (Human)
Description:
Q92769
Residue:
488
  
Inhibitor
Name:
BDBM50317991
Synonyms:
CHEMBL1097747 | N-(4-amino-3'-methoxybiphenyl-3-yl)benzamide
Type:
Small organic molecule
Emp. Form.:
C20H18N2O2
Mol. Mass.:
318.3691
SMILES:
COc1cccc(c1)-c1ccc(N)c(NC(=O)c2ccccc2)c1
: