Target
Acetylcholinesterase
Ligand
BDBM9058
Substrate
Meas. Tech.
ChEMBL_633769 (CHEMBL1119333)
IC50
1.9±n/a nM
Citation
 Lv, WXue, Y Prediction of acetylcholinesterase inhibitors and characterization of correlative molecular descriptors by machine learning methods. Eur J Med Chem 45:1167-72 (2010)  
Target
Name:
Acetylcholinesterase
Synonyms:
ACES_HUMAN Acetylcholinesterase (AChE) | Acetylcholinesterase (human AChE)
Type:
Enzyme
Mol. Mass.:
67792.70
Organism:
Homo sapiens (Human)
Description:
P22303
Residue:
614
  
Inhibitor
Name:
BDBM9058
Synonyms:
Homodimeric Tacrine Analog 3m N-(8-{6H,7H,8H,9H-cyclohexa[b]1,8-naphthyridin-5-ylamino}octyl)-6H,7H,8H,9H-cyclohexa[b]1,8-naphthyridin-5-amine
Type:
Small organic molecule
Emp. Form.:
C32H40N6
Mol. Mass.:
508.7002
SMILES:
C(CCCCNc1c2CCCCc2nc2ncccc12)CCCNc1c2CCCCc2nc2ncccc12
: