Target
Acetylcholinesterase
Ligand
BDBM50004040
Substrate
Meas. Tech.
ChEMBL_633769 (CHEMBL1119333)
IC50
12.5±n/a nM
Citation
 Lv, WXue, Y Prediction of acetylcholinesterase inhibitors and characterization of correlative molecular descriptors by machine learning methods. Eur J Med Chem 45:1167-72 (2010)  
Target
Name:
Acetylcholinesterase
Synonyms:
ACES_HUMAN Acetylcholinesterase (AChE) | Acetylcholinesterase (human AChE)
Type:
Enzyme
Mol. Mass.:
67792.70
Organism:
Homo sapiens (Human)
Description:
P22303
Residue:
614
  
Inhibitor
Name:
BDBM50004040
Synonyms:
2-(2-(1-benzylpiperidin-4-yl)ethyl)-5-nitroisoindoline-1,3-dione CHEMBL105874
Type:
Small organic molecule
Emp. Form.:
C22H23N3O4
Mol. Mass.:
393.4357
SMILES:
[O-][N+](=O)c1ccc2C(=O)N(CCC3CCN(Cc4ccccc4)CC3)C(=O)c2c1
: