Target
Neuromedin-K receptor
Ligand
BDBM50318916
Substrate
Meas. Tech.
ChEMBL_635274 (CHEMBL1118378)
Ki
0.95±n/a nM
Citation
 Peters, JUHoffmann, TSchnider, PStadler, HKoblet, AAlker, APoli, SMBallard, TMSpooren, WSteward, LSleight, AJ Discovery of potent, balanced and orally active dual NK1/NK3 receptor ligands. Bioorg Med Chem Lett 20:3405-8 (2010)  
Target
Name:
Neuromedin-K receptor
Synonyms:
NK-3 receptor NK3R NKR Neurokinin B receptor Neuromedin-3 receptor (NK-3R) Neuromedin-K receptor Neuromedin-K receptor (NK3) TAC3R Tachykinin receptor 3 | Tachykinin receptor 3 (NK3)
Type:
Enzyme
Mol. Mass.:
52221.96
Organism:
Homo sapiens (Human)
Description:
P29371
Residue:
465
  
Inhibitor
Name:
BDBM50318916
Synonyms:
2-(3,5-bis(trifluoromethyl)phenyl)-N-(4-(2-chlorophenyl)-6-((2-hydroxyethyl)(3-hydroxypropyl)amino)pyridin-3-yl)-N,2-dimethylpropanamide | CHEMBL1084165
Type:
Small organic molecule
Emp. Form.:
C29H30ClF6N3O3
Mol. Mass.:
618.01
SMILES:
CN(C(=O)C(C)(C)c1cc(cc(c1)C(F)(F)F)C(F)(F)F)c1cnc(cc1-c1ccccc1Cl)N(CCO)CCCO
: