Target
Histone deacetylase 1
Ligand
BDBM50319224
Substrate
Meas. Tech.
ChEMBL_633815 (CHEMBL1119893)
IC50
12000±n/a nM
Citation
 Wang, HLim, ZYZhou, YNg, MLu, TLee, KSangthongpitag, KGoh, KCWang, XWu, XKhng, HHGoh, SKOng, WCBonday, ZSun, ET Acylurea connected straight chain hydroxamates as novel histone deacetylase inhibitors: Synthesis, SAR, and in vivo antitumor activity. Bioorg Med Chem Lett 20:3314-21 (2010)  
Target
Name:
Histone deacetylase 1
Synonyms:
Cereblon/Histone deacetylase 1 HDAC1 Histone deacetylase 1 (HDAC1) RPD3L1
Type:
Enzyme
Mol. Mass.:
55090.27
Organism:
Homo sapiens (Human)
Description:
Q13547
Residue:
482
  
Inhibitor
Name:
BDBM50319224
Synonyms:
6-[3-(4-Morpholin-4-yl-3-nitro-benzoyl)-ureido]-hexanoic acid hydroxyamide | CHEMBL1084341
Type:
Small organic molecule
Emp. Form.:
C18H25N5O7
Mol. Mass.:
423.4204
SMILES:
ONC(=O)CCCCCNC(=O)NC(=O)c1ccc(N2CCOCC2)c(c1)[N+]([O-])=O
: