Target
Histamine H4 receptor
Ligand
BDBM50319300
Substrate
Meas. Tech.
ChEMBL_634017 (CHEMBL1117990)
EC50
0.56±n/a nM
Citation
 Savall, BMEdwards, JPVenable, JDBuzard, DJThurmond, RHack, MMcGovern, P Agonist/antagonist modulation in a series of 2-aryl benzimidazole H4 receptor ligands. Bioorg Med Chem Lett 20:3367-71 (2010)  
Target
Name:
Histamine H4 receptor
Synonyms:
AXOR35 GPCR105 HH4R HRH4 Histamine H4 receptor Histamine receptor (H3 and H4) SP9144
Type:
G Protein-Coupled Receptor (GPCR)
Mol. Mass.:
44517.02
Organism:
Homo sapiens (Human)
Description:
Binding assays were using CHO cells stably expressing hH4R receptors.
Residue:
390
  
Inhibitor
Name:
BDBM50319300
Synonyms:
CHEMBL1083162 | N-(2-(1H-imidazol-4-yl)ethyl)-3-(4-(5-fluoro-4-methyl-1H-benzo[d]imidazol-2-yl)-3-methylphenoxy)propan-1-amine
Type:
Small organic molecule
Emp. Form.:
C23H26FN5O
Mol. Mass.:
407.4838
SMILES:
Cc1cc(OCCCNCCc2cnc[nH]2)ccc1-c1nc2ccc(F)c(C)c2[nH]1
: