Target
Histamine H3 receptor
Ligand
BDBM50319538
Substrate
Meas. Tech.
ChEMBL_634305 (CHEMBL1120718)
Ki
0.3±n/a nM
Citation
 Liu, HAltenbach, RJDiaz, GJManelli, AMMartin, RLMiller, TREsbenshade, TABrioni, JDCowart, MD In vitro studies on a class of quinoline containing histamine H3 antagonists. Bioorg Med Chem Lett 20:3295-300 (2010)  
Target
Name:
Histamine H3 receptor
Synonyms:
HH3R Hrh3
Type:
G Protein-Coupled Receptor (GPCR)
Mol. Mass.:
48607.98
Organism:
Rattus norvegicus (rat)
Description:
Residue:
445
  
Inhibitor
Name:
BDBM50319538
Synonyms:
(R)-1-(4-(6-(2-(2-methylpyrrolidin-1-yl)ethyl)quinolin-2-yl)phenyl)pyridin-4(1H)-one | CHEMBL1086514
Type:
Small organic molecule
Emp. Form.:
C27H27N3O
Mol. Mass.:
409.5228
SMILES:
C[C@@H]1CCCN1CCc1ccc2nc(ccc2c1)-c1ccc(cc1)-n1ccc(=O)cc1
: