Target
Vasopressin V2 receptor
Ligand
BDBM50319799
Substrate
Meas. Tech.
ChEMBL_634857 (CHEMBL1120489)
Ki
600±n/a nM
Citation
 Crombie, ALAntrilli, TMCampbell, BACrandall, DLFailli, AAHe, YKern, JCMoore, WJNogle, LMTrybulski, EJ Synthesis and evaluation of azabicyclo[3.2.1]octane derivatives as potent mixed vasopressin antagonists. Bioorg Med Chem Lett 20:3742-5 (2010)  
Target
Name:
Vasopressin V2 receptor
Synonyms:
ADHR AVPR2 DIR Renal-type arginine vasopressin receptor V2R_HUMAN Vasopressin V2 receptor | Vasopressin receptor
Type:
Receptor
Mol. Mass.:
40295.28
Organism:
Homo sapiens (Human)
Description:
P30518
Residue:
371
  
Inhibitor
Name:
BDBM50319799
Synonyms:
(4-(1H-indol-3-yl)-3-methoxyphenyl)((1S,5R)-1,3,3-trimethyl-6-azabicyclo[3.2.1]octan-6-yl)methanone | CHEMBL1084008
Type:
Small organic molecule
Emp. Form.:
C26H30N2O2
Mol. Mass.:
402.5286
SMILES:
COc1cc(ccc1-c1c[nH]c2ccccc12)C(=O)N1C[C@]2(C)C[C@H]1CC(C)(C)C2
: