Target
Histone deacetylase 1
Ligand
BDBM50320750
Substrate
Meas. Tech.
ChEMBL_639141 (CHEMBL1167402)
IC50
>100000±n/a nM
Citation
 Kiyokawa, SHirata, YNagaoka, YShibano, MTaniguchi, MYasuda, MBaba, KUesato, S New orally bioavailable 2-aminobenzamide-type histone deacetylase inhibitor possessing a (2-hydroxyethyl)(4-(thiophen-2-yl)benzyl)amino group. Bioorg Med Chem 18:3925-33 (2010)  
Target
Name:
Histone deacetylase 1
Synonyms:
Cereblon/Histone deacetylase 1 HDAC1 Histone deacetylase 1 (HDAC1) RPD3L1
Type:
Enzyme
Mol. Mass.:
55090.27
Organism:
Homo sapiens (Human)
Description:
Q13547
Residue:
482
  
Inhibitor
Name:
BDBM50320750
Synonyms:
CHEMBL1163553 | N-(2-Aminophenyl)-4-((naphthalen-2-ylthio)ethyl)benzamide
Type:
Small organic molecule
Emp. Form.:
C24H20N2OS
Mol. Mass.:
384.493
SMILES:
Nc1ccccc1NC(=O)c1ccc(CSc2ccc3ccccc3c2)cc1
: