Target
KiSS-1 receptor
Ligand
BDBM50320806
Substrate
Meas. Tech.
ChEMBL_639178 (CHEMBL1167874)
IC50
>30000±n/a nM
Citation
 Kobayashi, TSasaki, STomita, NFukui, SKuroda, NNakayama, MKiba, ATakatsu, YOhtaki, TItoh, FBaba, A Synthesis and structure-activity relationships of 2-acylamino-4,6-diphenylpyridine derivatives as novel antagonists of GPR54. Bioorg Med Chem 18:3841-59 (2010)  
Target
Name:
KiSS-1 receptor
Synonyms:
AXOR12 G-protein coupled receptor 54 (GPR54) Hypogonadotropin-1 KISSR_HUMAN Kisspeptins receptor hOT7T175
Type:
G Protein-Coupled Receptor (GPCR)
Mol. Mass.:
42613.79
Organism:
Homo sapiens (Human)
Description:
Binding assay was performed using membranes from the CHO cell transfectants.
Residue:
398
  
Inhibitor
Name:
BDBM50320806
Synonyms:
CHEMBL1163805 | N-[4-(3-Aminophenyl)-3-cyano-6-(2-methoxyphenyl)-pyridin-2-yl]thiophene-2-carboxamide
Type:
Small organic molecule
Emp. Form.:
C24H18N4O2S
Mol. Mass.:
426.49
SMILES:
COc1ccccc1-c1cc(-c2cccc(N)c2)c(C#N)c(NC(=O)c2cccs2)n1
: