Target
KiSS-1 receptor
Ligand
BDBM50320812
Substrate
Meas. Tech.
ChEMBL_639179 (CHEMBL1167875)
IC50
6300±n/a nM
Citation
 Kobayashi, TSasaki, STomita, NFukui, SKuroda, NNakayama, MKiba, ATakatsu, YOhtaki, TItoh, FBaba, A Synthesis and structure-activity relationships of 2-acylamino-4,6-diphenylpyridine derivatives as novel antagonists of GPR54. Bioorg Med Chem 18:3841-59 (2010)  
Target
Name:
KiSS-1 receptor
Synonyms:
AXOR12 G-protein coupled receptor 54 (GPR54) Hypogonadotropin-1 KISSR_HUMAN Kisspeptins receptor hOT7T175
Type:
G Protein-Coupled Receptor (GPCR)
Mol. Mass.:
42613.79
Organism:
Homo sapiens (Human)
Description:
Binding assay was performed using membranes from the CHO cell transfectants.
Residue:
398
  
Inhibitor
Name:
BDBM50320812
Synonyms:
CHEMBL1163897 | N-{4-[3-(beta-Alanylamino)phenyl]-6-(4-bromo-2-hydroxyphenyl)-3-cyanopyridin-2-yl}thiophene-2-carboxamide
Type:
Small organic molecule
Emp. Form.:
C26H20BrN5O3S
Mol. Mass.:
562.438
SMILES:
NCCC(=O)Nc1cccc(c1)-c1cc(nc(NC(=O)c2cccs2)c1C#N)-c1ccc(Br)cc1O
: