Target
Serpin H1
Ligand
BDBM50320841
Substrate
Meas. Tech.
ChEMBL_636318 (CHEMBL1169041)
IC50
940±n/a nM
Citation
 Nishikawa, YTakahara, YAsada, SShigenaga, AOtaka, AKitagawa, KKoide, T A structure-activity relationship study elucidating the mechanism of sequence-specific collagen recognition by the chaperone HSP47. Bioorg Med Chem 18:3767-75 (2010)  
Target
Name:
Serpin H1
Synonyms:
Cbp1 SERPH_MOUSE | Serpinh1
Type:
PROTEIN
Mol. Mass.:
46545.13
Organism:
Mus musculus
Description:
ChEMBL_636318
Residue:
417
  
Inhibitor
Name:
BDBM50320841
Synonyms:
CHEMBL1163305
Type:
Small organic molecule
Emp. Form.:
C109H161N31O34
Mol. Mass.:
2449.6319
SMILES:
NC(=O)CNC(=O)[C@@H]1C[C@@H](O)CN1C(=O)[C@@H]1CCCN1C(=O)CNC(=O)[C@@H]1C[C@@H](O)CN1C(=O)[C@@H]1CCCN1C(=O)CNC(=O)[C@@H]1C[C@@H](O)CN1C(=O)[C@@H]1CCCN1C(=O)CNC(=O)[C@@H]1C[C@@H](O)CN1C(=O)[C@@H]1CCCN1C(=O)CNC(=O)[C@H](CCCNC(N)=N)NC(=O)[C@@H]1CCCN1C(=O)CNC(=O)[C@@H]1CCCN1C(=O)[C@@H]1CCCN1C(=O)CNC(=O)[C@@H]1C[C@@H](O)CN1C(=O)[C@@H]1CCCN1C(=O)CNC(=O)[C@@H]1C[C@@H](O)CN1C(=O)[C@@H]1CCCN1C(=O)CNC(=O)[C@@H]1C[C@@H](O)CN1C(=O)[C@@H]1CCCN1
: