Target
Bcl-2-like protein 1
Ligand
BDBM50321035
Substrate
Meas. Tech.
ChEMBL_639438 (CHEMBL1168411)
IC50
400000±n/a nM
Citation
 Leverrier, AMartin, MTServy, COuazzani, JRetailleau, PAwang, KMukhtar, MRGuéritte, FLitaudon, M Rearranged diterpenoids from the biotransformation of ent-trachyloban-18-oic acid by Rhizopus arrhizus. J Nat Prod 73:1121-5 (2010)  
Target
Name:
Bcl-2-like protein 1
Synonyms:
Anti-apoptotic Bcl-2 protein Apoptosis regulator Bcl-X BCL2-like 1 isoform 1 BCL2L1 Bcl-2-like protein 1 (Bcl-XL) Bcl-xL/Bcl-2-binding component 3 Bcl2-antagonist of cell death (BAD)
Type:
Mitochondrion membrane; Single-pass membrane protein
Mol. Mass.:
26039.60
Organism:
Homo sapiens (Human)
Description:
Residue:
233
  
Inhibitor
Name:
BDBM50321035
Synonyms:
CHEMBL1164460 | ent-Trachyloban-18-oic acid
Type:
Small organic molecule
Emp. Form.:
C20H30O2
Mol. Mass.:
302.451
SMILES:
C[C@@]12C[C@@]34C[C@@H]1[C@@H]2C[C@H]3[C@@]1(C)CCC[C@](C)([C@@H]1CC4)C(O)=O
: