Target
Polyphenol oxidase 2
Ligand
BDBM50321283
Substrate
Meas. Tech.
ChEMBL_638417 (CHEMBL1167863)
IC50
>100000±n/a nM
Citation
 Koyama, KHirasawa, YHosoya, THoe, TCChan, KLMorita, H Alpneumines A-H, new anti-melanogenic indole alkaloids from Alstonia pneumatophora. Bioorg Med Chem 18:4415-21 (2010)  
Target
Name:
Polyphenol oxidase 2
Synonyms:
Monophenol monooxygenase PPO2 Tyrosinase
Type:
Protein
Mol. Mass.:
63923.66
Organism:
Agaricus bisporus (Common mushroom)
Description:
O42713
Residue:
556
  
Inhibitor
Name:
BDBM50321283
Synonyms:
Alpneumine E | CHEMBL1163800
Type:
Small organic molecule
Emp. Form.:
C20H22N2O3
Mol. Mass.:
338.4003
SMILES:
COC(=O)C1[C@@H]2C[C@H]3N(CC[C@@]33C1=Nc1ccccc31)C[C@H]2C(C)=O
: