Target
Polyphenol oxidase 2
Ligand
BDBM50321284
Substrate
Meas. Tech.
ChEMBL_638417 (CHEMBL1167863)
IC50
>100000±n/a nM
Citation
 Koyama, KHirasawa, YHosoya, THoe, TCChan, KLMorita, H Alpneumines A-H, new anti-melanogenic indole alkaloids from Alstonia pneumatophora. Bioorg Med Chem 18:4415-21 (2010)  
Target
Name:
Polyphenol oxidase 2
Synonyms:
Monophenol monooxygenase PPO2 Tyrosinase
Type:
Protein
Mol. Mass.:
63923.66
Organism:
Agaricus bisporus (Common mushroom)
Description:
O42713
Residue:
556
  
Inhibitor
Name:
BDBM50321284
Synonyms:
Alpneumine F | CHEMBL1165402
Type:
Small organic molecule
Emp. Form.:
C20H22N2O4
Mol. Mass.:
354.3997
SMILES:
COC(=O)[C@@]12CO[C@]3(O)[C@H]4CCN(CC[C@@H]13)[C@H]4c1c2[nH]c2ccccc12
: