Target
Polyphenol oxidase 2
Ligand
BDBM50321285
Substrate
Meas. Tech.
ChEMBL_638417 (CHEMBL1167863)
IC50
>100000±n/a nM
Citation
 Koyama, KHirasawa, YHosoya, THoe, TCChan, KLMorita, H Alpneumines A-H, new anti-melanogenic indole alkaloids from Alstonia pneumatophora. Bioorg Med Chem 18:4415-21 (2010)  
Target
Name:
Polyphenol oxidase 2
Synonyms:
Monophenol monooxygenase PPO2 Tyrosinase
Type:
Protein
Mol. Mass.:
63923.66
Organism:
Agaricus bisporus (Common mushroom)
Description:
O42713
Residue:
556
  
Inhibitor
Name:
BDBM50321285
Synonyms:
Alpneumine G | CHEMBL1164480
Type:
Small organic molecule
Emp. Form.:
C21H26N2O4
Mol. Mass.:
370.4421
SMILES:
CC[C@@]12CCC[N+]3([O-])CCc4c([C@H]13)n(c1ccccc41)[C@](O)(C2)C(=O)OC
: