Target
Neuropeptide S receptor
Ligand
BDBM50322839
Substrate
Meas. Tech.
ChEMBL_644490 (CHEMBL1211328)
IC50
10.00±n/a nM
Citation
 Melamed, JYZartman, AEKett, NRGotter, ALUebele, VNReiss, DRCondra, CLFandozzi, CLubbers, LSRowe, BAMcGaughey, GBHenault, MStocco, RRenger, JJHartman, GDBilodeau, MTTrotter, BW Synthesis and evaluation of a new series of Neuropeptide S receptor antagonists. Bioorg Med Chem Lett 20:4700-3 (2010)  
Target
Name:
Neuropeptide S receptor
Synonyms:
GPR154 NPSR1 PGR14
Type:
PROTEIN
Mol. Mass.:
42692.30
Organism:
Homo sapiens (Human)
Description:
ChEMBL_1276607
Residue:
371
  
Inhibitor
Name:
BDBM50322839
Synonyms:
CHEMBL1210313 rac-N-(3-methyl-1-morpholinopentan-3-yl)-N-((1-methyl-2-oxo-1,2-dihydroquinolin-3-yl)methyl)cyclohexanecarboxamide
Type:
Small organic molecule
Emp. Form.:
C28H41N3O3
Mol. Mass.:
467.6434
SMILES:
CCC(C)(CCN1CCOCC1)N(Cc1cc2ccccc2n(C)c1=O)C(=O)C1CCCCC1
: