Target
B1 bradykinin receptor
Ligand
BDBM50322864
Substrate
Meas. Tech.
ChEMBL_644657 (CHEMBL1211636)
IC50
23±n/a nM
Citation
 Liu, QQian, WLi, ABiswas, KChen, JJFotsch, CHan, NYuan, CArik, LBiddlecome, GJohnson, EKumar, GLester-Zeiner, DNg, GYHungate, RWAskew, BC Aryl sulfonamides containing tetralin allylic amines as potent and selective bradykinin B1 receptor antagonists. Bioorg Med Chem Lett 20:4593-7 (2010)  
Target
Name:
B1 bradykinin receptor
Synonyms:
B1 BRADYKININ B1R BK-1 receptor BRADYB1 | Bradykinin B1 receptor
Type:
Enzyme
Mol. Mass.:
40508.87
Organism:
Homo sapiens (Human)
Description:
P46663
Residue:
353
  
Inhibitor
Name:
BDBM50322864
Synonyms:
(R)-N-((R)-6-(3-(2-methoxyethylamino)prop-1-en-2-yl)-1,2,3,4-tetrahydronaphthalen-1-yl)-3-phenyl-3-(3-(trifluoromethyl)phenylsulfonamido)propanamide | CHEMBL1210750
Type:
Small organic molecule
Emp. Form.:
C32H36F3N3O4S
Mol. Mass.:
615.706
SMILES:
COCCNCC(=C)c1ccc2[C@@H](CCCc2c1)NC(=O)C[C@@H](NS(=O)(=O)c1cccc(c1)C(F)(F)F)c1ccccc1
: