Target
B1 bradykinin receptor
Ligand
BDBM50322860
Substrate
Meas. Tech.
ChEMBL_644658 (CHEMBL1211637)
Ki
12±n/a nM
Citation
 Liu, QQian, WLi, ABiswas, KChen, JJFotsch, CHan, NYuan, CArik, LBiddlecome, GJohnson, EKumar, GLester-Zeiner, DNg, GYHungate, RWAskew, BC Aryl sulfonamides containing tetralin allylic amines as potent and selective bradykinin B1 receptor antagonists. Bioorg Med Chem Lett 20:4593-7 (2010)  
Target
Name:
B1 bradykinin receptor
Synonyms:
B1 BRADYKININ B1R BK-1 receptor BRADYB1 | Bradykinin B1 receptor
Type:
Enzyme
Mol. Mass.:
40508.87
Organism:
Homo sapiens (Human)
Description:
P46663
Residue:
353
  
Inhibitor
Name:
BDBM50322860
Synonyms:
(R)-N-((R)-6-(3-((R)-3-hydroxypyrrolidin-1-yl)prop-1-en-2-yl)-1,2,3,4-tetrahydronaphthalen-1-yl)-3-phenyl-3-(3-(trifluoromethyl)phenylsulfonamido)propanamide | CHEMBL1210746
Type:
Small organic molecule
Emp. Form.:
C33H36F3N3O4S
Mol. Mass.:
627.717
SMILES:
O[C@@H]1CCN(CC(=C)c2ccc3[C@@H](CCCc3c2)NC(=O)C[C@@H](NS(=O)(=O)c2cccc(c2)C(F)(F)F)c2ccccc2)C1
: